BDBM50048808 2-[4-(4-Benzo[d]isothiazol-3-yl-piperazin-1-yl)-but-2-ynyl]-isoindole-1,3-dione::CHEMBL43513
SMILES O=C1N(CC#CCN2CCN(CC2)c2nsc3ccccc23)C(=O)c2ccccc12
InChI Key InChIKey=LFDFDERYUSRWCV-UHFFFAOYSA-N
Data  2 IC50
  Tab Delimited (TSV)   2D SDfile   Computed 3D by Vconf -m prep SDfile
Find this compound or compounds like it in BindingDB:
Activity Spreadsheet -- Enzyme Inhibition Constant Data from BindingDB
Found 2 hits for monomerid = 50048808
TargetD(2) dopamine receptor(Rattus norvegicus (rat))
Glaxo Wellcome
Curated by ChEMBL
LigandPNGBDBM50048808(2-[4-(4-Benzo[d]isothiazol-3-yl-piperazin-1-yl)-bu...)
Affinity DataIC50:  2.80E+3nM. Assay description: Inhibition of [3H]-raclopride binding at Dopamine receptor D2 from rat striata.
In DepthDetails ArticlePubMed
Target5-hydroxytryptamine receptor 1A(Rattus norvegicus (rat))
Glaxo Wellcome
Curated by ChEMBL
LigandPNGBDBM50048808(2-[4-(4-Benzo[d]isothiazol-3-yl-piperazin-1-yl)-bu...)
Affinity DataIC50:  420nM. Assay description: Inhibition of [3H]-8-OH-DPAT binding at serotonin 5-hydroxytryptamine 1A receptor from rat hippocampus tissue.
In DepthDetails ArticlePubMed