BDBM50049169 (R)-2-((S)-4-Carboxy-4-{4-[methyl-(2-methyl-4-oxo-3,4-dihydro-quinazolin-6-ylmethyl)-amino]-benzoylamino}-butyrylamino)-pentanedioic acid; TFA::CHEMBL349488
SMILES CN(Cc1ccc2nc(C)[nH]c(=O)c2c1)c1ccc(cc1)C(=O)N[C@@H](CCC(=O)N[C@H](CCC(O)=O)C(O)=O)C(O)=O
InChI Key InChIKey=VCYSAGXELQYIEK-YADHBBJMSA-N
Data  1 IC50
  Tab Delimited (TSV)   2D SDfile   Computed 3D by Vconf -m prep SDfile
Find this compound or compounds like it in BindingDB:
Activity Spreadsheet -- Enzyme Inhibition Constant Data from BindingDB
Found 1 hit for monomerid = 50049169
TargetThymidylate synthase(Mus musculus)
Institute Of Cancer Research
Curated by ChEMBL
LigandPNGBDBM50049169((R)-2-((S)-4-Carboxy-4-{4-[methyl-(2-methyl-4-oxo-...)
Affinity DataIC50:  34nM. Assay description: Inhibition of Thymidylate synthase activity in L1210 cells
In DepthDetails ArticlePubMed