BDBM50049173 (S)-4-((S)-1-Carboxy-2-phenyl-ethylcarbamoyl)-2-{4-[(2-methyl-4-oxo-3,4-dihydro-quinazolin-6-ylmethyl)-prop-2-ynyl-amino]-benzoylamino}-butyric acid::CHEMBL352327
SMILES Cc1nc2ccc(CN(CC#C)c3ccc(cc3)C(=O)N[C@@H](CCC(=O)N[C@@H](Cc3ccccc3)C(O)=O)C(O)=O)cc2c(=O)[nH]1
InChI Key InChIKey=FKYIVZFRSYLENF-VMPREFPWSA-N
Data  1 IC50
  Tab Delimited (TSV)   2D SDfile   Computed 3D by Vconf -m prep SDfile
Find this compound or compounds like it in BindingDB:
Activity Spreadsheet -- Enzyme Inhibition Constant Data from BindingDB
Found 1 hit for monomerid = 50049173
TargetThymidylate synthase(Mus musculus)
Institute Of Cancer Research
Curated by ChEMBL
LigandPNGBDBM50049173((S)-4-((S)-1-Carboxy-2-phenyl-ethylcarbamoyl)-2-{4...)
Affinity DataIC50:  18nM. Assay description: Inhibition of Thymidylate synthase activity in L1210 cells
In DepthDetails ArticlePubMed