BDBM50049476 (2R,3R)-2-(3,5-Bis-trifluoromethyl-benzyloxy)-3-phenyl-morpholine::CHEMBL294960
SMILES FC(F)(F)c1cc(CO[C@@H]2OCCN[C@@H]2c2ccccc2)cc(c1)C(F)(F)F
InChI Key InChIKey=FUQXMZQIUQTJPV-SJORKVTESA-N
Data  2 IC50
  Tab Delimited (TSV)   2D SDfile   Computed 3D by Vconf -m prep SDfile
Find this compound or compounds like it in BindingDB:
Activity Spreadsheet -- Enzyme Inhibition Constant Data from BindingDB
Found 2 hits for monomerid = 50049476
TargetSubstance-P receptor(Homo sapiens (Human))
Merck Research Laboratories
Curated by ChEMBL
LigandPNGBDBM50049476((2R,3R)-2-(3,5-Bis-trifluoromethyl-benzyloxy)-3-ph...)
Affinity DataIC50:  116nM. Assay description: Displacement of [125I]-labeled SP from human Tachykinin receptor 1 expressed in CHO cells
In DepthDetails ArticlePubMed
TargetSubstance-P receptor(Homo sapiens (Human))
Merck Research Laboratories
Curated by ChEMBL
LigandPNGBDBM50049476((2R,3R)-2-(3,5-Bis-trifluoromethyl-benzyloxy)-3-ph...)
Affinity DataIC50:  116nM. Assay description: Displacement of [125I]-labeled SP from human Tachykinin receptor 1 expressed in CHO cells
In DepthDetails ArticlePubMed