BDBM50049564 14-amino-14-amino(imino)methyl-4-cyclopropylmethyl-(13R,14R)-12-oxa-4-azapentacyclo[9.6.1.01,13.05,17.07,18]octadeca-7(18),8,10-triene-10,17-diol::CHEMBL53963
SMILES NC(=N)[C@]1(N)CC[C@@]2(O)[C@H]3Cc4ccc(O)c5O[C@@H]1[C@]2(CCN3CC1CC1)c45
InChI Key InChIKey=HPTFPXLXBSYPMG-STSJCENXSA-N
Data  1 IC50
  Tab Delimited (TSV)   2D SDfile   Computed 3D by Vconf -m prep SDfile
Find this compound or compounds like it in BindingDB:
Activity Spreadsheet -- Enzyme Inhibition Constant Data from BindingDB
Found 1 hit for monomerid = 50049564
TargetMu-type opioid receptor(GUINEA PIG)
University Of Minnesota
Curated by ChEMBL
LigandPNGBDBM50049564(14-amino-14-amino(imino)methyl-4-cyclopropylmethyl...)
Affinity DataIC50:  18nM. Assay description: Opioid receptor mu 1 antagonistic activity in guinea pig ileum
In DepthDetails ArticlePubMed