BDBM50049624 6-(4,5-Difluoro-4'-methanesulfonyl-biphenyl-2-yl)-2,3-dihydro-benzo[1,4]dioxine::CHEMBL54746
SMILES CS(=O)(=O)c1ccc(cc1)-c1cc(F)c(F)cc1-c1ccc2OCCOc2c1
InChI Key InChIKey=DLEXWYPUXDTMQV-UHFFFAOYSA-N
Data  3 IC50
  Tab Delimited (TSV)   2D SDfile   Computed 3D by Vconf -m prep SDfile
Find this compound or compounds like it in BindingDB:
Activity Spreadsheet -- Enzyme Inhibition Constant Data from BindingDB
Found 3 hits for monomerid = 50049624
TargetProstaglandin G/H synthase 1(Homo sapiens (Human))
Searle Research And Development
Curated by ChEMBL
LigandPNGBDBM50049624(6-(4,5-Difluoro-4'-methanesulfonyl-biphenyl-2-yl)-...)
Affinity DataIC50: >1.00E+5nM. Assay description: In vitro inhibitory activity against human recombinant prostaglandin G/H synthase 1.
In DepthDetails ArticlePubMed
TargetProstaglandin G/H synthase 2(Homo sapiens (Human))
Universit£
Curated by ChEMBL
LigandPNGBDBM50049624(6-(4,5-Difluoro-4'-methanesulfonyl-biphenyl-2-yl)-...)
Affinity DataIC50:  339nM. Assay description: Inhibition of human Prostaglandin G/H synthase 2
In DepthDetails ArticlePubMed
TargetProstaglandin G/H synthase 2(Homo sapiens (Human))
Universit£
Curated by ChEMBL
LigandPNGBDBM50049624(6-(4,5-Difluoro-4'-methanesulfonyl-biphenyl-2-yl)-...)
Affinity DataIC50:  340nM. Assay description: In vitro inhibitory activity against human recombinant prostaglandin G/H synthase 2
In DepthDetails ArticlePubMed