BDBM50049660 4',5'-Difluoro-4''-methanesulfonyl-4-methyl-[1,1';2',1'']terphenyl::4',5'-Difluoro-4-methanesulfonyl-4''-methyl-[1,1';2',1'']terphenyl::CHEMBL293771
SMILES Cc1ccc(cc1)-c1cc(F)c(F)cc1-c1ccc(cc1)S(C)(=O)=O
InChI Key InChIKey=CFMPDXYFWIFIRY-UHFFFAOYSA-N
Data  3 IC50
  Tab Delimited (TSV)   2D SDfile   Computed 3D by Vconf -m prep SDfile
Find this compound or compounds like it in BindingDB:
Activity Spreadsheet -- Enzyme Inhibition Constant Data from BindingDB
Found 3 hits for monomerid = 50049660
TargetProstaglandin G/H synthase 1(Homo sapiens (Human))
Searle Research And Development
Curated by ChEMBL
LigandPNGBDBM50049660(4',5'-Difluoro-4''-methanesulfonyl-4-methyl-[1,1';...)
Affinity DataIC50: >1.00E+5nM. Assay description: In vitro inhibitory activity against human recombinant prostaglandin G/H synthase 1.
In DepthDetails ArticlePubMed
TargetProstaglandin G/H synthase 2(Homo sapiens (Human))
Universit£
Curated by ChEMBL
LigandPNGBDBM50049660(4',5'-Difluoro-4''-methanesulfonyl-4-methyl-[1,1';...)
Affinity DataIC50:  7.08nM. Assay description: Inhibition of human Prostaglandin G/H synthase 2
In DepthDetails ArticlePubMed
TargetProstaglandin G/H synthase 2(Homo sapiens (Human))
Universit£
Curated by ChEMBL
LigandPNGBDBM50049660(4',5'-Difluoro-4''-methanesulfonyl-4-methyl-[1,1';...)
Affinity DataIC50:  7nM. Assay description: In vitro inhibitory activity against human recombinant prostaglandin G/H synthase 2
In DepthDetails ArticlePubMed