BDBM50050060 2-[(R)-1-((S)-2-Cyclohexyloxycarbonylamino-4-methyl-pentanoylamino)-2-(1-methyl-1H-indol-3-yl)-ethyl]-5-methyl-oxazole-4-carboxylic acid::CHEMBL353320
SMILES CC(C)C[C@H](NC(=O)OC1CCCCC1)C(=O)N[C@H](Cc1cn(C)c2ccccc12)c1nc(C(O)=O)c(C)o1
InChI Key InChIKey=NVCMJDTXNXADGH-XZOQPEGZSA-N
Data  2 IC50
  Tab Delimited (TSV)   2D SDfile   Computed 3D by Vconf -m prep SDfile
Find this compound or compounds like it in BindingDB:
Activity Spreadsheet -- Enzyme Inhibition Constant Data from BindingDB
Found 2 hits for monomerid = 50050060
TargetEndothelin receptor type B(Homo sapiens (Human))
Abbott Laboratories
Curated by ChEMBL
LigandPNGBDBM50050060(2-[(R)-1-((S)-2-Cyclohexyloxycarbonylamino-4-methy...)
Affinity DataIC50: >1.00E+5nM. Assay description: Inhibitory activity was evaluated against human Endothelin B receptor
In DepthDetails ArticlePubMed
TargetEndothelin-1 receptor(Homo sapiens (Human))
Abbott Laboratories
Curated by ChEMBL
LigandPNGBDBM50050060(2-[(R)-1-((S)-2-Cyclohexyloxycarbonylamino-4-methy...)
Affinity DataIC50:  41nM. Assay description: Inhibitory activity was evaluated against human Endothelin A receptor
In DepthDetails ArticlePubMed