BDBM50050742 CHEMBL46346::N-((1S,2R)-7-Hydroxy-2-phenyl-1,2,3,4-tetrahydro-naphthalen-1-yl)-2,2-diphenyl-acetamide
SMILES Oc1ccc2CC[C@@H]([C@H](NC(=O)C(c3ccccc3)c3ccccc3)c2c1)c1ccccc1
InChI Key InChIKey=UQCXBSDLQFUVAF-UHSQPCAPSA-N
Data  1 IC50
  Tab Delimited (TSV)   2D SDfile   Computed 3D by Vconf -m prep SDfile
Find this compound or compounds like it in BindingDB:
Activity Spreadsheet -- Enzyme Inhibition Constant Data from BindingDB
Found 1 hit for monomerid = 50050742
TargetSterol O-acyltransferase 1(Rattus norvegicus)
Schering-Plough Research Institute
Curated by ChEMBL
LigandPNGBDBM50050742(CHEMBL46346 | N-((1S,2R)-7-Hydroxy-2-phenyl-1,2,3,...)
Affinity DataIC50:  2.40E+3nM. Assay description: In vitro inhibitory activity against acyl-coenzyme A:cholesterol acyltransferase 1 from rat hepatic microsomes.
In DepthDetails ArticlePubMed