BDBM50051233 7-tert-Butyl-2-furan-2-yl-7H-pyrazolo[4,3-e][1,2,4]triazolo[1,5-c]pyrimidin-5-ylamine::CHEMBL280067
SMILES CC(C)(C)n1ncc2c1nc(N)n1nc(nc21)-c1ccco1
InChI Key InChIKey=IRAJAJYBBMVTFR-UHFFFAOYSA-N
Data  2 KI
  Tab Delimited (TSV)   2D SDfile   Computed 3D by Vconf -m prep SDfile
Find this compound or compounds like it in BindingDB:
Activity Spreadsheet -- Enzyme Inhibition Constant Data from BindingDB
Found 2 hits for monomerid = 50051233
TargetAdenosine receptor A2a(Rattus norvegicus (rat))
Università
Curated by ChEMBL
LigandPNGBDBM50051233(7-tert-Butyl-2-furan-2-yl-7H-pyrazolo[4,3-e][1,2,4...)
Affinity DataKi:  260nM. Assay description: Inhibition of [3H]-CGS- 21680 binding to Adenosine A2A receptor in rat striatal homogenates.
In DepthDetails ArticlePubMed
TargetAdenosine receptor A1(Rattus norvegicus (rat))
Università
Curated by ChEMBL
LigandPNGBDBM50051233(7-tert-Butyl-2-furan-2-yl-7H-pyrazolo[4,3-e][1,2,4...)
Affinity DataKi:  430nM. Assay description: Inhibition of [3H]-CHA binding to Adenosine A1 receptor in rat whole brain homogenates.
In DepthDetails ArticlePubMed