BDBM50051342 3,6-Dichloro-2-(2-isobutoxy-4-methyl-phenyl)-chromen-4-one::CHEMBL307459
SMILES CC(C)COc1cc(C)ccc1-c1oc2ccc(Cl)cc2c(=O)c1Cl
InChI Key InChIKey=ZGMXVFQVTMUJFQ-UHFFFAOYSA-N
Data  1 KI
  Tab Delimited (TSV)   2D SDfile   Computed 3D by Vconf -m prep SDfile
Find this compound or compounds like it in BindingDB:
Activity Spreadsheet -- Enzyme Inhibition Constant Data from BindingDB
Found 1 hit for monomerid = 50051342
TargetAdenosine receptor A3(Homo sapiens (Human))
National Institute Of Diabetes
Curated by ChEMBL
LigandPNGBDBM50051342(3,6-Dichloro-2-(2-isobutoxy-4-methyl-phenyl)-chrom...)
Affinity DataKi:  561nM. Assay description: Binding affinity against human adenosine A3 receptor in HEK293 cells using [125I]-AB-MECA 21680 radioligand.
In DepthDetails ArticlePubMed