BDBM50051346 3-Hydroxy-6-methoxy-2-((E)-styryl)-chroman-4-one::CHEMBL74330
SMILES COc1ccc2oc(CCc3ccccc3)c(O)c(=O)c2c1
InChI Key InChIKey=VQKLKSFJEMDOQK-UHFFFAOYSA-N
Data  2 KI
  Tab Delimited (TSV)   2D SDfile   Computed 3D by Vconf -m prep SDfile
Find this compound or compounds like it in BindingDB:
Activity Spreadsheet -- Enzyme Inhibition Constant Data from BindingDB
Found 2 hits for monomerid = 50051346
TargetAdenosine receptor A3(Homo sapiens (Human))
National Institute Of Diabetes
Curated by ChEMBL
LigandPNGBDBM50051346(3-Hydroxy-6-methoxy-2-((E)-styryl)-chroman-4-one |...)
Affinity DataKi:  2.09E+4nM. Assay description: Ability to displace [125I]-AB-MECA binding from adenosine A3 receptor.Checked by Author
In DepthDetails ArticlePubMed
TargetAdenosine receptor A3(Homo sapiens (Human))
National Institute Of Diabetes
Curated by ChEMBL
LigandPNGBDBM50051346(3-Hydroxy-6-methoxy-2-((E)-styryl)-chroman-4-one |...)
Affinity DataKi:  2.11E+4nM. Assay description: Binding affinity against human adenosine A3 receptor in HEK293 cells using [125I]-AB-MECA 21680 radioligand.
In DepthDetails ArticlePubMed