BDBM50051367 (6S,8aS)-2-(1,5-Dimethyl-hex-4-enyl)-5,5,8a-trimethyl-1,2,3,5,6,7,8,8a-octahydro-isoquinolin-6-ol::CHEMBL75824
SMILES [#6]-[#6](-[#6]-[#6]\[#6]=[#6](\[#6])-[#6])-[#7]-1-[#6]-[#6]=[#6]2C([#6])([#6])[#6@@H](-[#8])-[#6]-[#6][C@]2([#6])[#6]-1
InChI Key InChIKey=WNDKOAFJEWVBCG-WVGSSIFTSA-N
Data  1 IC50
  Tab Delimited (TSV)   2D SDfile   Computed 3D by Vconf -m prep SDfile
Find this compound or compounds like it in BindingDB:
Activity Spreadsheet -- Enzyme Inhibition Constant Data from BindingDB
Found 1 hit for monomerid = 50051367
TargetLanosterol synthase(Rattus norvegicus)
Laboratoires Fournier
Curated by ChEMBL
LigandPNGBDBM50051367((6S,8aS)-2-(1,5-Dimethyl-hex-4-enyl)-5,5,8a-trimet...)
Affinity DataIC50:  1.70E+4nM. Assay description: Inhibitory activity against Oxidosqualene-lanosterol cyclase from Rat liver microsomes
In DepthDetails ArticlePubMed