BDBM50051372 (6R,8aR)-2-((E)-5,9-Dimethyl-deca-4,8-dienyl)-5,5,8a-trimethyl-1,2,3,5,6,7,8,8a-octahydro-isoquinolin-6-ol::CHEMBL310051
SMILES [#6]\[#6](-[#6])=[#6]/[#6]-[#6]\[#6](-[#6])=[#6]\[#6]-[#6]-[#6]-[#7]-1-[#6]-[#6]=[#6]2C([#6])([#6])[#6@H](-[#8])-[#6]-[#6][C@@]2([#6])[#6]-1
InChI Key InChIKey=BZZVMJFCRLBIFB-SUVORXIFSA-N
Data  2 IC50
  Tab Delimited (TSV)   2D SDfile   Computed 3D by Vconf -m prep SDfile
Find this compound or compounds like it in BindingDB:
Activity Spreadsheet -- Enzyme Inhibition Constant Data from BindingDB
Found 2 hits for monomerid = 50051372
TargetLanosterol synthase(Rattus norvegicus)
Laboratoires Fournier
Curated by ChEMBL
LigandPNGBDBM50051372((6R,8aR)-2-((E)-5,9-Dimethyl-deca-4,8-dienyl)-5,5,...)
Affinity DataIC50:  600nM. Assay description: Inhibitory activity against Oxidosqualene-lanosterol cyclase from Rat liver microsomes
In DepthDetails ArticlePubMed
TargetLanosterol synthase(Rattus norvegicus)
Laboratoires Fournier
Curated by ChEMBL
LigandPNGBDBM50051372((6R,8aR)-2-((E)-5,9-Dimethyl-deca-4,8-dienyl)-5,5,...)
Affinity DataIC50:  600nM. Assay description: Inhibitory activity against Oxidosqualene-lanosterol cyclase from Rat liver microsomes
In DepthDetails ArticlePubMed