BDBM50051672 2-Phenyl-9-((R)-1-phenyl-ethyl)-9H-pyrimido[4,5-b]indol-4-ylamine::2-Phenyl-9-(1-phenyl-ethyl)-9H-1,3,9-triaza-fluoren-4-ylamine::CHEMBL79415
SMILES C[C@H](c1ccccc1)n1c2ccccc2c2c(N)nc(nc12)-c1ccccc1
InChI Key InChIKey=VBCKEAQWAHLODG-MRXNPFEDSA-N
Data  3 KI
  Tab Delimited (TSV)   2D SDfile   Computed 3D by Vconf -m prep SDfile
Find this compound or compounds like it in BindingDB:
Activity Spreadsheet -- Enzyme Inhibition Constant Data from BindingDB
Found 3 hits for monomerid = 50051672
TargetAdenosine receptor A1(Rattus norvegicus (rat))
Julius-Maximilians-UniversitäT WüRzburg
Curated by ChEMBL
LigandPNGBDBM50051672(2-Phenyl-9-((R)-1-phenyl-ethyl)-9H-pyrimido[4,5-b]...)
Affinity DataKi:  2.60nM. Assay description: Radioligand binding assay for [3H]-PIA affinity towards Adenosine A1 receptor of rat cerebral cortical membrane
In DepthDetails ArticlePubMed
TargetAdenosine receptor A1(BOVINE)
Universit£
Curated by ChEMBL
LigandPNGBDBM50051672(2-Phenyl-9-((R)-1-phenyl-ethyl)-9H-pyrimido[4,5-b]...)
Affinity DataKi:  2.60nM. Assay description: Binding affinity at bovine Adenosine A1 receptor.
In DepthDetails ArticlePubMed
TargetAdenosine receptor A2a(Rattus norvegicus (rat))
Julius-Maximilians-UniversitäT WüRzburg
Curated by ChEMBL
LigandPNGBDBM50051672(2-Phenyl-9-((R)-1-phenyl-ethyl)-9H-pyrimido[4,5-b]...)
Affinity DataKi:  6.20E+3nM. Assay description: Radioligand binding assay for [3H]-NECA affinity towards adenosine A2A receptor of rat striatum
In DepthDetails ArticlePubMed