BDBM50051730 6-Propyl-1,5-dihydro-pyrazolo[3,4-d]pyrimidin-4-one::CHEMBL316254
SMILES CCCc1nc2n[nH]cc2c(=O)[nH]1
InChI Key InChIKey=WJAMSGLYNDIKLO-UHFFFAOYSA-N
Data  1 IC50
  Tab Delimited (TSV)   2D SDfile   Computed 3D by Vconf -m prep SDfile
Find this compound or compounds like it in BindingDB:
Activity Spreadsheet -- Enzyme Inhibition Constant Data from BindingDB
Found 1 hit for monomerid = 50051730
TargetXanthine dehydrogenase/oxidase(Homo sapiens (Human))
Università
Curated by ChEMBL
LigandPNGBDBM50051730(6-Propyl-1,5-dihydro-pyrazolo[3,4-d]pyrimidin-4-on...)
Affinity DataIC50: >1.00E+5nM. Assay description: Inhibitory activity against Xanthine Oxidase
In DepthDetails ArticlePubMed