BDBM50051903 2-[1,3]Dioxolan-2-yl-4,5-diphenyl-1H-imidazole::CHEMBL284952
SMILES C1COC(O1)c1nc(c([nH]1)-c1ccccc1)-c1ccccc1
InChI Key InChIKey=LQICXRNBJXHQRX-UHFFFAOYSA-N
Data  1 IC50
  Tab Delimited (TSV)   2D SDfile   Computed 3D by Vconf -m prep SDfile
Find this compound or compounds like it in BindingDB:
Activity Spreadsheet -- Enzyme Inhibition Constant Data from BindingDB
Found 1 hit for monomerid = 50051903
TargetSterol O-acyltransferase 1(Rattus norvegicus)
RhôNe-Poulenc Rorer
Curated by ChEMBL
LigandPNGBDBM50051903(2-[1,3]Dioxolan-2-yl-4,5-diphenyl-1H-imidazole | C...)
Affinity DataIC50:  4.80E+3nM. Assay description: In vitro inhibition of Acyl coenzyme A:cholesterol acyltransferase 1 from rat liver.
In DepthDetails ArticlePubMed