BDBM50051920 2,4-DIAMINO-6-[N-(3',4',5'-TRIMETHOXYBENZYL)-N-METHYLAMINO]PYRIDO[2,3-D]PYRIMIDINE::CHEMBL32190::N*6*-Methyl-N*6*-(3,4,5-trimethoxy-benzyl)-pyrido[2,3-d]pyrimidine-2,4,6-triamine
SMILES COc1cc(CN(C)c2cnc3nc(N)nc(N)c3c2)cc(OC)c1OC
InChI Key InChIKey=PUOZHLHNKHRTOW-UHFFFAOYSA-N
Data  6 IC50
PDB links: 2 PDB IDs match this monomer.
  Tab Delimited (TSV)   2D SDfile   Computed 3D by Vconf -m prep SDfile
Find this compound or compounds like it in BindingDB:
Activity Spreadsheet -- Enzyme Inhibition Constant Data from BindingDB
Found 6 hits for monomerid = 50051920
TargetDihydrofolate reductase(Rattus norvegicus (rat))
Duquesne University
Curated by ChEMBL
LigandPNGBDBM50051920(2,4-DIAMINO-6-[N-(3',4',5'-TRIMETHOXYBENZYL)-N-MET...)
Affinity DataIC50:  33nM. Assay description: Inhibitory activity against rat liver dihydrofolate reductase (in 90 microM dihydrofolic acid)
TargetBifunctional dihydrofolate reductase-thymidylate synthase(Toxoplasma gondii)
Duquesne University
Curated by ChEMBL
LigandPNGBDBM50051920(2,4-DIAMINO-6-[N-(3',4',5'-TRIMETHOXYBENZYL)-N-MET...)
Affinity DataIC50:  14nM. Assay description: Inhibitory activity against Toxoplasma gondii dihydrofolate reductase (in 90 microM dihydrofolic acid)
In DepthDetails ArticlePubMed
TargetDihydrofolate reductase(Pneumocystis carinii)
Duquesne University
Curated by ChEMBL
LigandPNGBDBM50051920(2,4-DIAMINO-6-[N-(3',4',5'-TRIMETHOXYBENZYL)-N-MET...)
Affinity DataIC50:  61nM. Assay description: Inhibition of Pneumocystis carinii dihydrofolate reductase
In DepthDetails ArticlePubMed
TargetDihydrofolate reductase(Rattus norvegicus (rat))
Duquesne University
Curated by ChEMBL
LigandPNGBDBM50051920(2,4-DIAMINO-6-[N-(3',4',5'-TRIMETHOXYBENZYL)-N-MET...)
Affinity DataIC50:  33nM. Assay description: Inhibition of rat liver dihydrofolate reductase
TargetBifunctional dihydrofolate reductase-thymidylate synthase(Toxoplasma gondii)
Duquesne University
Curated by ChEMBL
LigandPNGBDBM50051920(2,4-DIAMINO-6-[N-(3',4',5'-TRIMETHOXYBENZYL)-N-MET...)
Affinity DataIC50:  14nM. Assay description: Inhibition of Toxoplasma gondii dihydrofolate reductase
In DepthDetails ArticlePubMed
TargetDihydrofolate reductase(Pneumocystis carinii)
Duquesne University
Curated by ChEMBL
LigandPNGBDBM50051920(2,4-DIAMINO-6-[N-(3',4',5'-TRIMETHOXYBENZYL)-N-MET...)
Affinity DataIC50:  61nM. Assay description: Inhibitory activity against Pneumocystis carinii dihydrofolate reductase (in 90 microM dihydrofolic acid)
In DepthDetails ArticlePubMed