BDBM50052136 3-((3R,4aR,5S,6S,6aS,10S,10aR,10bS)-5-Acetoxy-10,10b-dihydroxy-3,4a,7,7,10a-pentamethyl-1-oxo-3-vinyl-dodecahydro-benzo[f]chromen-6-yloxycarbonylamino)-propionic acid ethyl ester::CHEMBL432817
SMILES CCOC(=O)CCNC(=O)O[C@@H]1[C@H](OC(C)=O)[C@@]2(C)O[C@](C)(CC(=O)[C@]2(O)[C@@]2(C)[C@@H](O)CCC(C)(C)[C@H]12)C=C
InChI Key InChIKey=NBGKIAYIVJMJKF-YBFVGNIGSA-N
Data  1 IC50  2 EC50
  Tab Delimited (TSV)   2D SDfile   Computed 3D by Vconf -m prep SDfile
Find this compound or compounds like it in BindingDB:
Activity Spreadsheet -- Enzyme Inhibition Constant Data from BindingDB
Found 3 hits for monomerid = 50052136
TargetAdenylate cyclase type 1(Homo sapiens (Human))
Food And Drug Administration
Curated by ChEMBL
LigandPNGBDBM50052136(3-((3R,4aR,5S,6S,6aS,10S,10aR,10bS)-5-Acetoxy-10,1...)
Affinity DataIC50:  44nM. Assay description: Inhibition of [125 I]-6-IHPP-forskolin binding to adenylate cyclase 1
In DepthDetails ArticlePubMed
TargetAdenylate cyclase type 1(Homo sapiens (Human))
Food And Drug Administration
Curated by ChEMBL
LigandPNGBDBM50052136(3-((3R,4aR,5S,6S,6aS,10S,10aR,10bS)-5-Acetoxy-10,1...)
Affinity DataEC50: >2.00E+3nM. Assay description: Ability to activate the conversion of [32P] ATP to [32P]-cyclic AMP mediated by adenylate cyclase 1
In DepthDetails ArticlePubMed
TargetAdenylate cyclase type 1(Homo sapiens (Human))
Food And Drug Administration
Curated by ChEMBL
LigandPNGBDBM50052136(3-((3R,4aR,5S,6S,6aS,10S,10aR,10bS)-5-Acetoxy-10,1...)
Affinity DataEC50:  3.50E+3nM. Assay description: Conversion of [32P] ATP to [32P]-cyclic AMP mediated by adenylate cyclase 1
In DepthDetails ArticlePubMed