BDBM50052969 3-{2-[Methyl-(2-pyrrolidin-1-yl-ethyl)-amino]-ethyl}-phenylamine::CHEMBL118160
SMILES CN(CCN1CCCC1)CCc1cccc(N)c1
InChI Key InChIKey=MOLXMWFUMXCTFY-UHFFFAOYSA-N
Data  1 KI
  Tab Delimited (TSV)   2D SDfile   Computed 3D by Vconf -m prep SDfile
Find this compound or compounds like it in BindingDB:
Activity Spreadsheet -- Enzyme Inhibition Constant Data from BindingDB
Found 1 hit for monomerid = 50052969
TargetSigma non-opioid intracellular receptor 1(Homo sapiens (Human))
National Institute Of Diabetes And Digestive And Kidney Diseases
Curated by ChEMBL
LigandPNGBDBM50052969(3-{2-[Methyl-(2-pyrrolidin-1-yl-ethyl)-amino]-ethy...)
Affinity DataKi:  579nM. Assay description: Displacement of [3H]-(+)-pentazocine from Sigma opioid receptor type 1 in guinea pig brain membrane
In DepthDetails ArticlePubMed