BDBM50053416 CHEMBL3317465
SMILES Fc1ccc(cc1)C(=O)CCCN1CCC(CC1)(OC(=O)CCc1cn(CCOCCOCCOCCn2cc(CCC(=O)OC3(CCN(CCCC(=O)c4ccc(F)cc4)CC3)c3ccc(Cl)cc3)nn2)nn1)c1ccc(Cl)cc1
InChI Key InChIKey=PPVWOMBOQZECHS-UHFFFAOYSA-N
Data  5 KI
  Tab Delimited (TSV)   2D SDfile   Computed 3D by Vconf -m prep SDfile
Find this compound or compounds like it in BindingDB:
Activity Spreadsheet -- Enzyme Inhibition Constant Data from BindingDB
Found 5 hits for monomerid = 50053416
TargetD(2) dopamine receptor(Homo sapiens (Human))
Friedrich-Alexander University
Curated by ChEMBL
LigandPNGBDBM50053416(CHEMBL3317465)
Affinity DataKi:  1nM. Assay description: Displacement of [3H]spiperone from human D2long receptor stably expressed in CHO cell membranes by competitive binding assay
In DepthDetails ArticlePubMed
TargetD(2) dopamine receptor(Homo sapiens (Human))
Friedrich-Alexander University
Curated by ChEMBL
LigandPNGBDBM50053416(CHEMBL3317465)
Affinity DataKi:  3nM. Assay description: Displacement of [3H]spiperone from human D2short receptor stably expressed in CHO cell membranes by competitive binding assay
In DepthDetails ArticlePubMed
TargetD(3) dopamine receptor(Homo sapiens (Human))
Friedrich-Alexander University
Curated by ChEMBL
LigandPNGBDBM50053416(CHEMBL3317465)
Affinity DataKi:  9.80nM. Assay description: Displacement of [3H]spiperone from human D3 receptor stably expressed in CHO cell membranes by competitive binding assay
In DepthDetails ArticlePubMed
TargetD(4) dopamine receptor(Homo sapiens (Human))
Friedrich-Alexander University
Curated by ChEMBL
LigandPNGBDBM50053416(CHEMBL3317465)
Affinity DataKi:  41nM. Assay description: Displacement of [3H]spiperone from human D4.4 receptor stably expressed in CHO cell membranes by competitive binding assay
In DepthDetails ArticlePubMed
TargetD(1A) dopamine receptor(Sus scrofa)
Friedrich-Alexander University
Curated by ChEMBL
LigandPNGBDBM50053416(CHEMBL3317465)
Affinity DataKi:  120nM. Assay description: Displacement of [3H]SCH23390 from porcine striatal membranes D1 receptor by competitive binding assay
In DepthDetails ArticlePubMed