BDBM50053613 2-Methoxy-5-Chloro-Phenyl biguanide::CHEMBL335877
SMILES COc1ccc(Cl)cc1NC(N)=NC(N)=N
InChI Key InChIKey=PDTVBRINWYWWLT-UHFFFAOYSA-N
Data  1 KI
  Tab Delimited (TSV)   2D SDfile   Computed 3D by Vconf -m prep SDfile
Find this compound or compounds like it in BindingDB:
Activity Spreadsheet -- Enzyme Inhibition Constant Data from BindingDB
Found 1 hit for monomerid = 50053613
Target5-hydroxytryptamine receptor 3A/3B/3C/3D/3E(Homo sapiens (Human))
Virginia Commonwealth University
Curated by ChEMBL
LigandPNGBDBM50053613(2-Methoxy-5-Chloro-Phenyl biguanide | CHEMBL335877)
Affinity DataKi:  126nM. Assay description: Compound was tested for the inhibition of [3H]-GR-65,630 binding to 5-hydroxytryptamine 3 receptor expressed in NG 108-15 cells
In DepthDetails ArticlePubMed