BDBM50053627 1,1-Dimethyl-4-(3-trifluoromethyl-phenyl)-piperazin-1-ium::CHEMBL336079
SMILES C[N+]1(C)CCN(CC1)c1cccc(c1)C(F)(F)F
InChI Key InChIKey=QVUDKRKAJKNMSO-UHFFFAOYSA-N
Data  2 KI
  Tab Delimited (TSV)   2D SDfile   Computed 3D by Vconf -m prep SDfile
Find this compound or compounds like it in BindingDB:
Activity Spreadsheet -- Enzyme Inhibition Constant Data from BindingDB
Found 2 hits for monomerid = 50053627
TargetNeuronal acetylcholine receptor subunit alpha-4/beta-2(Rattus norvegicus (Rat))
Universit£
Curated by ChEMBL
LigandPNGBDBM50053627(1,1-Dimethyl-4-(3-trifluoromethyl-phenyl)-piperazi...)
Affinity DataKi:  1.20E+3nM. Assay description: Binding affinity against nicotinic receptors from rat brain using [3H]cystine as radioligand
In DepthDetails ArticlePubMed
Target5-hydroxytryptamine receptor 3A/3B/3C/3D/3E(Homo sapiens (Human))
Virginia Commonwealth University
Curated by ChEMBL
LigandPNGBDBM50053627(1,1-Dimethyl-4-(3-trifluoromethyl-phenyl)-piperazi...)
Affinity DataKi: >1.00E+4nM. Assay description: Compound was tested for the inhibition of [3H]-GR-65,630 binding to 5-hydroxytryptamine 3 receptor expressed in NG 108-15 cells
In DepthDetails ArticlePubMed