BDBM50053689 3-[4-(4-Benzo[d]isothiazol-3-yl-piperazin-1-yl)-butyl]-5-(1-hydroxy-1-methyl-ethyl)-thiazolidin-4-one::CHEMBL339926
SMILES CC(C)(O)C1SCN(CCCCN2CCN(CC2)c2nsc3ccccc23)C1=O
InChI Key InChIKey=XKVRLBCGIKZDIN-UHFFFAOYSA-N
Data  2 IC50
  Tab Delimited (TSV)   2D SDfile   Computed 3D by Vconf -m prep SDfile
Find this compound or compounds like it in BindingDB:
Activity Spreadsheet -- Enzyme Inhibition Constant Data from BindingDB
Found 2 hits for monomerid = 50053689
TargetD(2) dopamine receptor(Rattus norvegicus (rat))
Hoechst Marion Roussel
Curated by ChEMBL
LigandPNGBDBM50053689(3-[4-(4-Benzo[d]isothiazol-3-yl-piperazin-1-yl)-bu...)
Affinity DataIC50:  29nM. Assay description: Binding affinity towards Dopamine receptor D2 was determined in rat striatum using [3H]- spiperone as radioligand
In DepthDetails ArticlePubMed
Target5-hydroxytryptamine receptor 1A(Rattus norvegicus (rat))
Hoechst Marion Roussel
Curated by ChEMBL
LigandPNGBDBM50053689(3-[4-(4-Benzo[d]isothiazol-3-yl-piperazin-1-yl)-bu...)
Affinity DataIC50:  12nM. Assay description: Binding affinity towards serotonin 5-HT1A receptor was determined in rat hippocampus using [3H]8-OH-DPAT as ligand
In DepthDetails ArticlePubMed