BDBM50053701 3-[4-(4-Quinolin-2-yl-piperazin-1-yl)-butyl]-thiazolidin-4-one::CHEMBL130978
SMILES O=C1CSCN1CCCCN1CCN(CC1)c1ccc2ccccc2n1
InChI Key InChIKey=YQHZHOKPYRZPNU-UHFFFAOYSA-N
Data  1 IC50
  Tab Delimited (TSV)   2D SDfile   Computed 3D by Vconf -m prep SDfile
Find this compound or compounds like it in BindingDB:
Activity Spreadsheet -- Enzyme Inhibition Constant Data from BindingDB
Found 1 hit for monomerid = 50053701
Target5-hydroxytryptamine receptor 1A(Rattus norvegicus (rat))
Hoechst Marion Roussel
Curated by ChEMBL
LigandPNGBDBM50053701(3-[4-(4-Quinolin-2-yl-piperazin-1-yl)-butyl]-thiaz...)
Affinity DataIC50:  332nM. Assay description: Binding affinity towards serotonin 5-HT1A receptor was determined in rat hippocampus using [3H]8-OH-DPAT as ligand
In DepthDetails ArticlePubMed