BDBM50053706 5,5-Dimethyl-3-[4-(4-quinolin-2-yl-piperazin-1-yl)-butyl]-thiazolidin-4-one::CHEMBL128170
SMILES CC1(C)SCN(CCCCN2CCN(CC2)c2ccc3ccccc3n2)C1=O
InChI Key InChIKey=LQKJNLJPXWCMKZ-UHFFFAOYSA-N
Data  1 IC50
  Tab Delimited (TSV)   2D SDfile   Computed 3D by Vconf -m prep SDfile
Find this compound or compounds like it in BindingDB:
Activity Spreadsheet -- Enzyme Inhibition Constant Data from BindingDB
Found 1 hit for monomerid = 50053706
Target5-hydroxytryptamine receptor 1A(Rattus norvegicus (rat))
Hoechst Marion Roussel
Curated by ChEMBL
LigandPNGBDBM50053706(5,5-Dimethyl-3-[4-(4-quinolin-2-yl-piperazin-1-yl)...)
Affinity DataIC50:  153nM. Assay description: Binding affinity towards serotonin 5-HT1A receptor was determined in rat hippocampus using [3H]8-OH-DPAT as ligand
In DepthDetails ArticlePubMed