BDBM50053731 2,2-Dimethyl-3-{4-[4-(3-methylsulfanyl-phenyl)-piperazin-1-yl]-butyl}-thiazolidin-4-one::CHEMBL131307
SMILES CSc1cccc(c1)N1CCN(CCCCN2C(=O)CSC2(C)C)CC1
InChI Key InChIKey=PGGVCCGESXXUMZ-UHFFFAOYSA-N
Data  2 IC50
  Tab Delimited (TSV)   2D SDfile   Computed 3D by Vconf -m prep SDfile
Find this compound or compounds like it in BindingDB:
Activity Spreadsheet -- Enzyme Inhibition Constant Data from BindingDB
Found 2 hits for monomerid = 50053731
TargetD(2) dopamine receptor(Rattus norvegicus (rat))
Hoechst Marion Roussel
Curated by ChEMBL
LigandPNGBDBM50053731(2,2-Dimethyl-3-{4-[4-(3-methylsulfanyl-phenyl)-pip...)
Affinity DataIC50:  2.43E+3nM. Assay description: Binding affinity towards Dopamine receptor D2 was determined in rat striatum using [3H]- spiperone as radioligand
In DepthDetails ArticlePubMed
Target5-hydroxytryptamine receptor 1A(Rattus norvegicus (rat))
Hoechst Marion Roussel
Curated by ChEMBL
LigandPNGBDBM50053731(2,2-Dimethyl-3-{4-[4-(3-methylsulfanyl-phenyl)-pip...)
Affinity DataIC50:  9nM. Assay description: Binding affinity towards serotonin 5-HT1A receptor was determined in rat hippocampus using [3H]8-OH-DPAT as ligand
In DepthDetails ArticlePubMed