BDBM50053749 5,5-Dimethyl-3-[4-(4-m-tolyl-piperazin-1-yl)-butyl]-thiazolidin-4-one::CHEMBL424266
SMILES Cc1cccc(c1)N1CCN(CCCCN2CSC(C)(C)C2=O)CC1
InChI Key InChIKey=SKMMUQAPKODBNV-UHFFFAOYSA-N
Data  2 IC50
  Tab Delimited (TSV)   2D SDfile   Computed 3D by Vconf -m prep SDfile
Find this compound or compounds like it in BindingDB:
Activity Spreadsheet -- Enzyme Inhibition Constant Data from BindingDB
Found 2 hits for monomerid = 50053749
Target5-hydroxytryptamine receptor 1A(Rattus norvegicus (rat))
Hoechst Marion Roussel
Curated by ChEMBL
LigandPNGBDBM50053749(5,5-Dimethyl-3-[4-(4-m-tolyl-piperazin-1-yl)-butyl...)
Affinity DataIC50:  12nM. Assay description: Binding affinity towards serotonin 5-HT1A receptor was determined in rat hippocampus using [3H]8-OH-DPAT as ligand
In DepthDetails ArticlePubMed
TargetD(2) dopamine receptor(Rattus norvegicus (rat))
Hoechst Marion Roussel
Curated by ChEMBL
LigandPNGBDBM50053749(5,5-Dimethyl-3-[4-(4-m-tolyl-piperazin-1-yl)-butyl...)
Affinity DataIC50:  2.64E+3nM. Assay description: Binding affinity towards Dopamine receptor D2 was determined in rat striatum using [3H]- spiperone as radioligand
In DepthDetails ArticlePubMed