BDBM50054008 (E)-6-(6-Carbamoyl-4-hydroxy-7-methyl-3-oxo-1,3-dihydro-isobenzofuran-5-yl)-4-methyl-hex-4-enoic acid::CHEMBL133974
SMILES C\C(CCC(O)=O)=C/Cc1c(O)c2C(=O)OCc2c(C)c1C(N)=O
InChI Key InChIKey=KIROVVCQYIINRP-FPYGCLRLSA-N
Data  1 IC50
  Tab Delimited (TSV)   2D SDfile   Computed 3D by Vconf -m prep SDfile
Find this compound or compounds like it in BindingDB:
Activity Spreadsheet -- Enzyme Inhibition Constant Data from BindingDB
Found 1 hit for monomerid = 50054008
TargetInosine-5'-monophosphate dehydrogenase 2(Homo sapiens (Human))
Syntex Research
Curated by ChEMBL
LigandPNGBDBM50054008((E)-6-(6-Carbamoyl-4-hydroxy-7-methyl-3-oxo-1,3-di...)
Affinity DataIC50:  231nM. Assay description: Inhibition of human recombinant inosine monophosphate dehydrogenase type II .
In DepthDetails ArticlePubMed