BDBM50054010 (E)-6-(7-Cyano-4-hydroxy-6-methoxy-3-oxo-1,3-dihydro-isobenzofuran-5-yl)-4-methyl-hex-4-enoic acid::CHEMBL134132
SMILES COc1c(C\C=C(/C)CCC(O)=O)c(O)c2C(=O)OCc2c1C#N
InChI Key InChIKey=WYNGKRRKXMHYLE-YCRREMRBSA-N
Data  1 IC50
  Tab Delimited (TSV)   2D SDfile   Computed 3D by Vconf -m prep SDfile
Find this compound or compounds like it in BindingDB:
Activity Spreadsheet -- Enzyme Inhibition Constant Data from BindingDB
Found 1 hit for monomerid = 50054010
TargetInosine-5'-monophosphate dehydrogenase 2(Homo sapiens (Human))
Syntex Research
Curated by ChEMBL
LigandPNGBDBM50054010((E)-6-(7-Cyano-4-hydroxy-6-methoxy-3-oxo-1,3-dihyd...)
Affinity DataIC50: >1.00E+5nMpH: 8.0Assay Description:Inhibition of human recombinant type II Inosine Monophosphate Dehydrogenase. at pH 8.0
In DepthDetails ArticlePubMed