BDBM50054047 (E)-6-(3-Bromo-2-chloro-6-methoxy-4,5-dimethyl-phenyl)-4-methyl-hex-4-enoic acid::CHEMBL336412
SMILES COc1c(C)c(C)c(Br)c(Cl)c1C\C=C(/C)CCC(O)=O
InChI Key InChIKey=NNXMRBLCYGPCSC-WEVVVXLNSA-N
Data  1 IC50
  Tab Delimited (TSV)   2D SDfile   Computed 3D by Vconf -m prep SDfile
Find this compound or compounds like it in BindingDB:
Activity Spreadsheet -- Enzyme Inhibition Constant Data from BindingDB
Found 1 hit for monomerid = 50054047
TargetInosine-5'-monophosphate dehydrogenase 2(Homo sapiens (Human))
Syntex Research
Curated by ChEMBL
LigandPNGBDBM50054047((E)-6-(3-Bromo-2-chloro-6-methoxy-4,5-dimethyl-phe...)
Affinity DataIC50:  1.04E+3nM. Assay description: Inhibition of human recombinant type II Inosine Monophosphate Dehydrogenase at 100 microM
In DepthDetails ArticlePubMed