BDBM50054089 (2R,3R)-2-Amino-3-phenyl-indan-5-ol::CHEMBL135224
SMILES N[C@@H]1Cc2ccc(O)cc2[C@H]1c1ccccc1
InChI Key InChIKey=FLDPVLFJZMQUDO-HUUCEWRRSA-N
Data  4 KI
  Tab Delimited (TSV)   2D SDfile   Computed 3D by Vconf -m prep SDfile
Find this compound or compounds like it in BindingDB:
Activity Spreadsheet -- Enzyme Inhibition Constant Data from BindingDB
Found 4 hits for monomerid = 50054089
TargetD(2) dopamine receptor(Rattus norvegicus (rat))
Universit£
Curated by ChEMBL
LigandPNGBDBM50054089((2R,3R)-2-Amino-3-phenyl-indan-5-ol | CHEMBL135224)
Affinity DataKi:  0.590nM. Assay description: Binding affinity at Dopamine receptor D2 in rat striatal homogenate by [3H]-spiperone displacement.
In DepthDetails ArticlePubMed
TargetD(2) dopamine receptor(Rattus norvegicus (rat))
Universit£
Curated by ChEMBL
LigandPNGBDBM50054089((2R,3R)-2-Amino-3-phenyl-indan-5-ol | CHEMBL135224)
Affinity DataKi:  0.590nM. Assay description: Binding affinity at Dopamine receptor D2 in rat striatal homogenate by [3H]-spiperone displacement.
In DepthDetails ArticlePubMed
TargetD(1A) dopamine receptor(RAT)
Universit£
Curated by ChEMBL
LigandPNGBDBM50054089((2R,3R)-2-Amino-3-phenyl-indan-5-ol | CHEMBL135224)
Affinity DataKi:  2.5nM. Assay description: Binding affinity at Dopamine receptor D1 in rat neostriatum by [3H]-SCH- 23390 displacement.
In DepthDetails ArticlePubMed
TargetD(1A) dopamine receptor(RAT)
Universit£
Curated by ChEMBL
LigandPNGBDBM50054089((2R,3R)-2-Amino-3-phenyl-indan-5-ol | CHEMBL135224)
Affinity DataKi:  2.5nM. Assay description: Binding affinity at Dopamine receptor D1 in rat neostriatum by [3H]-SCH- 23390 displacement.
In DepthDetails ArticlePubMed