BDBM50054193 (3S,10R,13R)-10,13-Dimethyl-17-vinyl-2,3,4,7,8,9,10,11,12,13,14,15,16,17-tetradecahydro-1H-cyclopenta[a]phenanthren-3-ol::CHEMBL422456
SMILES C[C@]12CCC3C(CC=C4C[C@@H](O)CC[C@]34C)C1CCC2C=C
InChI Key InChIKey=AXSZNOPJKXHJAB-VDTAABSNSA-N
Data  2 IC50
  Tab Delimited (TSV)   2D SDfile   Computed 3D by Vconf -m prep SDfile
Find this compound or compounds like it in BindingDB:
Activity Spreadsheet -- Enzyme Inhibition Constant Data from BindingDB
Found 2 hits for monomerid = 50054193
TargetSteroid 17-alpha-hydroxylase/17,20 lyase(Homo sapiens (Human))
University Of Maryland
Curated by ChEMBL
LigandPNGBDBM50054193((3S,10R,13R)-10,13-Dimethyl-17-vinyl-2,3,4,7,8,9,1...)
Affinity DataIC50:  2.88E+3nM. Assay description: Inhibition of human testicular steroid 17-alpha-hydroxylase
In DepthDetails ArticlePubMed
TargetSteroid 17-alpha-hydroxylase/17,20 lyase(Homo sapiens (Human))
University Of Maryland
Curated by ChEMBL
LigandPNGBDBM50054193((3S,10R,13R)-10,13-Dimethyl-17-vinyl-2,3,4,7,8,9,1...)
Affinity DataIC50:  2.88E+3nM. Assay description: Inhibition of human testicular steroid 17-alpha-hydroxylase
In DepthDetails ArticlePubMed