BDBM50054204 (3S,10R,13S)-10,13-Dimethyl-17-((R)-2-methyl-oxiranyl)-2,3,4,7,8,9,10,11,12,13,14,15,16,17-tetradecahydro-1H-cyclopenta[a]phenanthren-3-ol::CHEMBL137616
SMILES C[C@]1(CO1)C1CCC2C3CC=C4C[C@@H](O)CC[C@]4(C)C3CC[C@]12C
InChI Key InChIKey=RUTUFQZITDCWGJ-RJTNGYIFSA-N
Data  2 IC50
  Tab Delimited (TSV)   2D SDfile   Computed 3D by Vconf -m prep SDfile
Find this compound or compounds like it in BindingDB:
Activity Spreadsheet -- Enzyme Inhibition Constant Data from BindingDB
Found 2 hits for monomerid = 50054204
TargetSteroid 17-alpha-hydroxylase/17,20 lyase(Homo sapiens (Human))
University Of Maryland
Curated by ChEMBL
LigandPNGBDBM50054204((3S,10R,13S)-10,13-Dimethyl-17-((R)-2-methyl-oxira...)
Affinity DataIC50:  720nM. Assay description: Inhibition of human testicular 17-alpha-hydroxylase
In DepthDetails ArticlePubMed
TargetSteroid 17-alpha-hydroxylase/17,20 lyase(Homo sapiens (Human))
University Of Maryland
Curated by ChEMBL
LigandPNGBDBM50054204((3S,10R,13S)-10,13-Dimethyl-17-((R)-2-methyl-oxira...)
Affinity DataIC50:  730nM. Assay description: Inhibition of human testicular steroid 17-alpha-hydroxylase
In DepthDetails ArticlePubMed