BDBM50054265 CHEMBL3319384::US9522881, 11c-2 (L88M49)
SMILES Cn1c(c(I)c2cc(C(O)=O)c(O)cc12)-c1cccc(NC(=O)CCC(=O)Nc2ccc(Oc3ccccc3)cc2)c1
InChI Key InChIKey=AGSICTIJMBRYGB-UHFFFAOYSA-N
Data  2 IC50
  Tab Delimited (TSV)   2D SDfile   Computed 3D by Vconf -m prep SDfile
Find this compound or compounds like it in BindingDB:
Activity Spreadsheet -- Enzyme Inhibition Constant Data from BindingDB
Found 2 hits for monomerid = 50054265
TargetTyrosine-protein phosphatase non-receptor type 11(Homo sapiens (Human))
Indiana University School Of Medicine
Curated by ChEMBL
LigandPNGBDBM50054265(CHEMBL3319384 | US9522881, 11c-2 (L88M49))
Affinity DataIC50:  3.60E+3nM. Assay description: Inhibition of SHP2 (unknown origin) using p-nitrophenyl phosphate substrate by microplate spectrophotometry
In DepthDetails ArticlePubMed
TargetPhosphatidylinositol 3,4,5-trisphosphate 5-phosphatase 2(Homo sapiens (Human))
Indiana University Research And Technology
US Patent
LigandPNGBDBM50054265(CHEMBL3319384 | US9522881, 11c-2 (L88M49))
Affinity DataIC50:  3.60E+3nMpH: 7.0Assay Description:The inhibition assays were performed at 25° C. in 50 mM 3,3-dimethylglutarate buffer, pH 7.0, containing 1 mM EDTA with an ionic strength of 0.15M ad...
In DepthDetails US Patent