BDBM50054278 1-(2,6-Diisopropyl-phenyl)-3-(5-tridecyl-isoxazol-3-yl)-urea::CHEMBL138886
SMILES CCCCCCCCCCCCCc1cc(NC(=O)Nc2c(cccc2C(C)C)C(C)C)no1
InChI Key InChIKey=RVCXSEPZHZNOAW-UHFFFAOYSA-N
Data  1 IC50
  Tab Delimited (TSV)   2D SDfile   Computed 3D by Vconf -m prep SDfile
Find this compound or compounds like it in BindingDB:
Activity Spreadsheet -- Enzyme Inhibition Constant Data from BindingDB
Found 1 hit for monomerid = 50054278
TargetAcyl-CoA:cholesterol acyltransferase(Oryctolagus cuniculus)
Warner-Lambert
Curated by ChEMBL
LigandPNGBDBM50054278(1-(2,6-Diisopropyl-phenyl)-3-(5-tridecyl-isoxazol-...)
Affinity DataIC50:  14nM. Assay description: Acyl coenzyme A:cholesterol acyltransferase 1 inhibition in vitro measured in rabbit intestinal microsomes
In DepthDetails ArticlePubMed