BDBM50054420 12-(3,4-dihydroxy-6-hydroxymethyl-5-methoxytetrahydro-2H-2-pyranyl)-6,7,12,13-tetrahydro-5H-indolo[2,3-a]pyrrolo[3,4-c]carbazole-5,7-dione::CHEMBL47243
SMILES COC1C(CO)OC(C(O)C1O)n1c2ccccc2c2c3C(=O)NC(=O)c3c3c4ccccc4[nH]c3c12
InChI Key InChIKey=JNMXCWUKDUQJFF-UHFFFAOYSA-N
Data  2 IC50
  Tab Delimited (TSV)   2D SDfile   Computed 3D by Vconf -m prep SDfile
Find this compound or compounds like it in BindingDB:
Activity Spreadsheet -- Enzyme Inhibition Constant Data from BindingDB
Found 2 hits for monomerid = 50054420
TargetProtein kinase C alpha type(Homo sapiens (Human))
Université
Curated by ChEMBL
LigandPNGBDBM50054420(12-(3,4-dihydroxy-6-hydroxymethyl-5-methoxytetrahy...)
Affinity DataIC50: >1.00E+5nM. Assay description: Inhibition of Protein Kinase C(PKC)
In DepthDetails ArticlePubMed
TargetProtein kinase C alpha type(Homo sapiens (Human))
Université
Curated by ChEMBL
LigandPNGBDBM50054420(12-(3,4-dihydroxy-6-hydroxymethyl-5-methoxytetrahy...)
Affinity DataIC50: >1.00E+5nM. Assay description: Inhibition of Protein kinase C alpha
In DepthDetails ArticlePubMed