BDBM50054481 (S)-2-[2-((S)-2-{(S)-2-[2-((S)-2-Amino-5-guanidino-pentanoylamino)-acetylamino]-3-carboxy-propionylamino}-5-guanidino-pentanoylamino)-acetylamino]-succinic acid::CHEMBL141005
SMILES N[C@@H](CCCNC(N)=N)C(=O)NCC(=O)N[C@@H](CC(O)=O)C(=O)N[C@@H](CCCNC(N)=N)C(=O)NCC(=O)N[C@@H](CC(O)=O)C(O)=O
InChI Key InChIKey=FLHCHHMYNKVLLP-XUXIUFHCSA-N
Data  5 IC50
  Tab Delimited (TSV)   2D SDfile   Computed 3D by Vconf -m prep SDfile
Find this compound or compounds like it in BindingDB:
Activity Spreadsheet -- Enzyme Inhibition Constant Data from BindingDB
Found 5 hits for monomerid = 50054481
TargetIntegrin alpha-IIb/beta-3(Homo sapiens (Human))
Texas A&M University
Curated by ChEMBL
LigandPNGBDBM50054481((S)-2-[2-((S)-2-{(S)-2-[2-((S)-2-Amino-5-guanidino...)
Affinity DataIC50: >1.00E+5nM. Assay description: Inhibition of human platelet aggregation mediated by alpha llb/beta3 interaction with fibrinogen
In DepthDetails ArticlePubMed
TargetIntegrin alpha-V/beta-3(Homo sapiens (Human))
Texas A&M University
Curated by ChEMBL
LigandPNGBDBM50054481((S)-2-[2-((S)-2-{(S)-2-[2-((S)-2-Amino-5-guanidino...)
Affinity DataIC50:  70nM. Assay description: Inhibition of alphaV-beta3 interaction with vitronectin
In DepthDetails ArticlePubMed
TargetIntegrin alpha-V/beta-5(Homo sapiens (Human))
Jiangnan University
Curated by ChEMBL
LigandPNGBDBM50054481((S)-2-[2-((S)-2-{(S)-2-[2-((S)-2-Amino-5-guanidino...)
Affinity DataIC50:  5.46E+5nM. Assay description: Antagonist activity at integrin alphaVbeta5 (unknown origin) expressed in HT-29 cells assessed as reduction in cell adhesion to vitronectin after 2 h...
In DepthDetails ArticlePubMed
TargetIntegrin alpha-V/beta-3(Homo sapiens (Human))
Texas A&M University
Curated by ChEMBL
LigandPNGBDBM50054481((S)-2-[2-((S)-2-{(S)-2-[2-((S)-2-Amino-5-guanidino...)
Affinity DataIC50:  6.19E+5nM. Assay description: Antagonist activity at integrin alphaVbeta3 (unknown origin) expressed in HEK293 cells assessed as reduction in cell adhesion to fibrinogen after 2 h...
In DepthDetails ArticlePubMed
TargetIntegrin alpha-V/beta-3/beta-5(Homo sapiens (Human))
Jiangnan University
Curated by ChEMBL
LigandPNGBDBM50054481((S)-2-[2-((S)-2-{(S)-2-[2-((S)-2-Amino-5-guanidino...)
Affinity DataIC50:  7.53E+5nM. Assay description: Antagonist activity at integrin alphaVbeta3alphaVbeta5 (unknown origin) expressed in SKOV3 cells assessed as reduction in cell adhesion to fibrinogen...
In DepthDetails ArticlePubMed