BDBM50054493 CHEMBL343805::N-((S)-3-Carbamimidoyl-2-hydroxy-cyclohexyl)-2-((S)-2-oxo-3-phenylmethanesulfonylamino-azepan-1-yl)-acetamide
SMILES NC(=N)C1CCC[C@H](NC(=O)CN2CCCC[C@H](NS(=O)(=O)Cc3ccccc3)C2=O)C1O
InChI Key InChIKey=JXHRRVFVLWWLCI-NRGCRIOASA-N
Data  3 IC50
  Tab Delimited (TSV)   2D SDfile   Computed 3D by Vconf -m prep SDfile
Find this compound or compounds like it in BindingDB:
Activity Spreadsheet -- Enzyme Inhibition Constant Data from BindingDB
Found 3 hits for monomerid = 50054493
TargetProthrombin(Homo sapiens (Human))
Corvas International
Curated by ChEMBL
LigandPNGBDBM50054493(CHEMBL343805 | N-((S)-3-Carbamimidoyl-2-hydroxy-cy...)
Affinity DataIC50:  0.710nM. Assay description: In vitro for inhibition of serine protease thrombin(FIIa).
In DepthDetails ArticlePubMed
TargetCoagulation factor X(Homo sapiens (Human))
Corvas International
Curated by ChEMBL
LigandPNGBDBM50054493(CHEMBL343805 | N-((S)-3-Carbamimidoyl-2-hydroxy-cy...)
Affinity DataIC50:  20.6nM. Assay description: In vitro for inhibition of Coagulation factor X
In DepthDetails ArticlePubMed
TargetSerine protease 1(Homo sapiens (Human))
Corvas International
Curated by ChEMBL
LigandPNGBDBM50054493(CHEMBL343805 | N-((S)-3-Carbamimidoyl-2-hydroxy-cy...)
Affinity DataIC50:  74.5nM. Assay description: In vitro for inhibition of serine protease Trypsin.
In DepthDetails ArticlePubMed