BDBM50054623 4-Hydroxy-3-(1-phenyl-propyl)-1-oxa-spiro[5.5]undec-3-en-2-one::CHEMBL143401
SMILES CCC(C1C(=O)CC2(CCCCC2)OC1=O)c1ccccc1
InChI Key InChIKey=ANGOAHHESHXEMR-UHFFFAOYSA-N
Data  1 IC50
  Tab Delimited (TSV)   2D SDfile   Computed 3D by Vconf -m prep SDfile
Find this compound or compounds like it in BindingDB:
Activity Spreadsheet -- Enzyme Inhibition Constant Data from BindingDB
Found 1 hit for monomerid = 50054623
TargetGag-Pol polyprotein [489-587](Human immunodeficiency virus type 1)
Pharmacia & Upjohn
Curated by ChEMBL
LigandPNGBDBM50054623(4-Hydroxy-3-(1-phenyl-propyl)-1-oxa-spiro[5.5]unde...)
Affinity DataIC50:  780nM. Assay description: HIV Protease inhibitory activity
In DepthDetails ArticlePubMed