BDBM50054774 1-(4-Hydroxy-5-hydroxymethyl-tetrahydro-furan-2-yl)-5-thiophen-3-yl-1H-pyrimidine-2,4-dione::CHEMBL1791157
SMILES OC[C@H]1O[C@H](C[C@@H]1O)n1cc(-c2ccsc2)c(=O)[nH]c1=O
InChI Key InChIKey=PUZHIJNFHYHTSN-UHFFFAOYSA-N
Data  1 IC50
  Tab Delimited (TSV)   2D SDfile   Computed 3D by Vconf -m prep SDfile
Find this compound or compounds like it in BindingDB:
Activity Spreadsheet -- Enzyme Inhibition Constant Data from BindingDB
Found 1 hit for monomerid = 50054774
TargetThymidine kinase(Human herpesvirus 1 (strain SC16) (HHV-1) (Human h...)
Katholieke Universiteit Leuven
Curated by ChEMBL
LigandPNGBDBM50054774(1-(4-Hydroxy-5-hydroxymethyl-tetrahydro-furan-2-yl...)
Affinity DataIC50:  4.00E+3nM. Assay description: Binding affinity towards HSV-1 thymidine kinase
In DepthDetails ArticlePubMed