BDBM50055781 CHEMBL147652::[1-(3-Chloro-benzyl)-5-methoxy-2-methyl-1H-indol-3-yl]-acetic acid hydrazide
SMILES COc1ccc2n(Cc3cccc(Cl)c3)c(C)c(CC(=O)NN)c2c1
InChI Key InChIKey=JNDMWQNRNKLUDE-UHFFFAOYSA-N
Data  1 IC50
  Tab Delimited (TSV)   2D SDfile   Computed 3D by Vconf -m prep SDfile
Find this compound or compounds like it in BindingDB:
Activity Spreadsheet -- Enzyme Inhibition Constant Data from BindingDB
Found 1 hit for monomerid = 50055781
TargetPhospholipase A2, membrane associated(Homo sapiens (Human))
Eli Lilly
Curated by ChEMBL
LigandPNGBDBM50055781(CHEMBL147652 | [1-(3-Chloro-benzyl)-5-methoxy-2-me...)
Affinity DataIC50:  1.36E+3nM. Assay description: Inhibition of Human Nonpancreatic Secretory Phospholipase A2 through Chromogenic assay
In DepthDetails ArticlePubMed