BDBM50056087 3-{3-[1-(3,3-Dimethyl-2-oxo-butyl)-2-oxo-5-phenyl-2,3-dihydro-1H-benzo[e][1,4]diazepin-3-yl]-ureido}-benzoic acid::CHEMBL113988
SMILES CC(C)(C)C(=O)CN1c2ccccc2C(=NC(NC(=O)Nc2cccc(c2)C(O)=O)C1=O)c1ccccc1
InChI Key InChIKey=WFNOPNJYCVFERE-UHFFFAOYSA-N
Data  2 IC50
  Tab Delimited (TSV)   2D SDfile   Computed 3D by Vconf -m prep SDfile
Find this compound or compounds like it in BindingDB:
Activity Spreadsheet -- Enzyme Inhibition Constant Data from BindingDB
Found 2 hits for monomerid = 50056087
TargetCholecystokinin receptor type A(RAT)
Ferring Research Institute
Curated by ChEMBL
LigandPNGBDBM50056087(3-{3-[1-(3,3-Dimethyl-2-oxo-butyl)-2-oxo-5-phenyl-...)
Affinity DataIC50:  2.06E+3nM. Assay description: Inhibitory concentration against radioligand [3 H]L-364,718 binding to gastrin/Cholecystokinin type A receptor from rat pancreas
In DepthDetails ArticlePubMed
TargetGastrin/cholecystokinin type B receptor(RAT)
Ferring Research Institute
Curated by ChEMBL
LigandPNGBDBM50056087(3-{3-[1-(3,3-Dimethyl-2-oxo-butyl)-2-oxo-5-phenyl-...)
Affinity DataIC50:  3.29nM. Assay description: Inhibitory concentration against radioligand [125I]-CCK-8 binding to gastrin/Cholecystokinin type B receptor from rat brain
In DepthDetails ArticlePubMed