BDBM50056095 1-(3-Dimethylamino-phenyl)-3-[(R)-1-(3,3-dimethyl-2-oxo-butyl)-2-oxo-5-pyridin-2-yl-2,3-dihydro-1H-benzo[e][1,4]diazepin-3-yl]-urea::CHEMBL325863
SMILES CN(C)c1cccc(NC(=O)N[C@@H]2N=C(c3ccccn3)c3ccccc3N(CC(=O)C(C)(C)C)C2=O)c1
InChI Key InChIKey=INMWFCCMIFVEPO-SANMLTNESA-N
Data  2 IC50
  Tab Delimited (TSV)   2D SDfile   Computed 3D by Vconf -m prep SDfile
Find this compound or compounds like it in BindingDB:
Activity Spreadsheet -- Enzyme Inhibition Constant Data from BindingDB
Found 2 hits for monomerid = 50056095
TargetCholecystokinin receptor type A(RAT)
Ferring Research Institute
Curated by ChEMBL
LigandPNGBDBM50056095(1-(3-Dimethylamino-phenyl)-3-[(R)-1-(3,3-dimethyl-...)
Affinity DataIC50:  113nM. Assay description: Inhibitory concentration against radioligand [3 H]L-364,718 binding to gastrin/Cholecystokinin type A receptor from rat pancreas
In DepthDetails ArticlePubMed
TargetGastrin/cholecystokinin type B receptor(RAT)
Ferring Research Institute
Curated by ChEMBL
LigandPNGBDBM50056095(1-(3-Dimethylamino-phenyl)-3-[(R)-1-(3,3-dimethyl-...)
Affinity DataIC50:  0.200nM. Assay description: Inhibitory concentration against radioligand [125I]-CCK-8 binding to gastrin/Cholecystokinin type B receptor from rat brain
In DepthDetails ArticlePubMed