BDBM50056276 CHEMBL1230240
SMILES OC[C@H]1O[C@@H](NC(=O)C(=O)Nc2ccccn2)[C@H](O)[C@@H](O)[C@@H]1O
InChI Key InChIKey=XWDCGBAAIPNJDU-ODYQSLDMSA-N
Data  1 KI
PDB links: 1 PDB ID matches this monomer.
  Tab Delimited (TSV)   2D SDfile   Computed 3D by Vconf -m prep SDfile
Find this compound or compounds like it in BindingDB:
Activity Spreadsheet -- Enzyme Inhibition Constant Data from BindingDB
Found 1 hit for monomerid = 50056276
TargetGlycogen phosphorylase, muscle form(Oryctolagus cuniculus (rabbit))
University Of Thessaly
Curated by ChEMBL
LigandPNGBDBM50056276(CHEMBL1230240)
Affinity DataKi:  2.30E+5nM. Assay description: Inhibition of rabbit skeletal muscle glycogen phosphorylase b assessed as inorganic phosphate release