BDBM50056447 (R)-5,6-Dihydro-4H-imidazo[4,5,1-ij]quinolin-5-yl-dimethyl-amine::CHEMBL345458
SMILES CN(C)[C@@H]1Cc2cccc3ncn(C1)c23
InChI Key InChIKey=SHTKKIRPSYJFRO-SNVBAGLBSA-N
Data  3 KI
  Tab Delimited (TSV)   2D SDfile   Computed 3D by Vconf -m prep SDfile
Find this compound or compounds like it in BindingDB:
Activity Spreadsheet -- Enzyme Inhibition Constant Data from BindingDB
Found 3 hits for monomerid = 50056447
TargetD(2) dopamine receptor(Homo sapiens (Human))
Pharmacia & Upjohn
Curated by ChEMBL
LigandPNGBDBM50056447((R)-5,6-Dihydro-4H-imidazo[4,5,1-ij]quinolin-5-yl-...)
Affinity DataKi:  1.28E+3nM. Assay description: Binding affinity towards Dopamine receptor D2 by displacement of [3H]-U-86,170.
In DepthDetails ArticlePubMed
TargetD(3) dopamine receptor(Homo sapiens (Human))
Pharmacia & Upjohn
Curated by ChEMBL
LigandPNGBDBM50056447((R)-5,6-Dihydro-4H-imidazo[4,5,1-ij]quinolin-5-yl-...)
Affinity DataKi:  2.95E+3nM. Assay description: Binding affinity towards Dopamine receptor D3 by displacement of [3H]-(+)-7-OH-DPAT.
In DepthDetails ArticlePubMed
Target5-hydroxytryptamine receptor 1A(Homo sapiens (Human))
Pharmacia & Upjohn
Curated by ChEMBL
LigandPNGBDBM50056447((R)-5,6-Dihydro-4H-imidazo[4,5,1-ij]quinolin-5-yl-...)
Affinity DataKi: >3.52E+3nM. Assay description: Binding affinity towards Serotonin 5-hydroxytryptamine 1A receptor by displacement of [3H]-(+)-8-OH-DPAT.
In DepthDetails ArticlePubMed