BDBM50056508 CHEMBL3341945
SMILES COc1cc(cc(OC)c1OC)-c1cc(cnc1N)-c1ccc(cc1)N1CCNCC1
InChI Key InChIKey=SJOCBUINMBQCTH-UHFFFAOYSA-N
Data  6 IC50
  Tab Delimited (TSV)   2D SDfile   Computed 3D by Vconf -m prep SDfile
Find this compound or compounds like it in BindingDB:
Activity Spreadsheet -- Enzyme Inhibition Constant Data from BindingDB
Found 6 hits for monomerid = 50056508
TargetActivin receptor type-1(Homo sapiens (Human))
Massachusetts Institute Of Technology
Curated by ChEMBL
LigandPNGBDBM50056508(CHEMBL3341945)
Affinity DataIC50:  10nM. Assay description: Inhibition of human recombinant human ALK2 kinase after 45 mins by liquid scintillation counting in presence of ATP [gamma-32P]
In DepthDetails ArticlePubMed
TargetTGF-beta receptor type-1(Homo sapiens (Human))
Massachusetts Institute Of Technology
Curated by ChEMBL
LigandPNGBDBM50056508(CHEMBL3341945)
Affinity DataIC50:  186nM. Assay description: Inhibition of purified human ALK5 kinase after 45 mins by liquid scintillation counting in presence of ATP [gamma-32P]
In DepthDetails ArticlePubMed
TargetActivin receptor type-1(Mus musculus)
Massachusetts Institute Of Technology
Curated by ChEMBL
LigandPNGBDBM50056508(CHEMBL3341945)
Affinity DataIC50:  4nM. Assay description: Inhibition of BMP6-induced BMP receptor type 1 ALK2 in mouse C2C12 cells after 30 mins by luciferase reporter gene assay
In DepthDetails ArticlePubMed
TargetActivin receptor type-1(Mus musculus)
Massachusetts Institute Of Technology
Curated by ChEMBL
LigandPNGBDBM50056508(CHEMBL3341945)
Affinity DataIC50:  16nM. Assay description: Inhibition of BMP2-induced BMP receptor type 1 ALK2 in mouse C2C12 cells after 30 mins by luciferase reporter gene assay
In DepthDetails ArticlePubMed
TargetActivin receptor type-1(Mus musculus)
Massachusetts Institute Of Technology
Curated by ChEMBL
LigandPNGBDBM50056508(CHEMBL3341945)
Affinity DataIC50:  27nM. Assay description: Inhibition of BMP4-induced BMP receptor in mouse C2C12 cells after 30 mins by luciferase reporter gene assay
In DepthDetails ArticlePubMed
TargetTGF-beta receptor type-1(Homo sapiens (Human))
Massachusetts Institute Of Technology
Curated by ChEMBL
LigandPNGBDBM50056508(CHEMBL3341945)
Affinity DataIC50:  100nM. Assay description: Inhibition of TGFbeta1-induced TGFbeta type 1 ALK5 in HEK293T cells after 30 mins by luciferase reporter gene assay
In DepthDetails ArticlePubMed