BDBM50059894 CHEMBL103153::[2-(2-Ethyl-phenylsulfanylcarbonyloxy)-ethyl]-trimethyl-ammonium; chloride
SMILES CCc1ccccc1SC(=O)OCC[N+](C)(C)C
InChI Key InChIKey=QKHHDZBHOMQEPG-UHFFFAOYSA-N
Data  2 IC50
  Tab Delimited (TSV)   2D SDfile   Computed 3D by Vconf -m prep SDfile
Find this compound or compounds like it in BindingDB:
Activity Spreadsheet -- Enzyme Inhibition Constant Data from BindingDB
Found 2 hits for monomerid = 50059894
TargetAcetylcholinesterase(Bos taurus (bovine))
University Of North Texas
Curated by ChEMBL
LigandPNGBDBM50059894(CHEMBL103153 | [2-(2-Ethyl-phenylsulfanylcarbonylo...)
Affinity DataIC50:  1.00E+4nM. Assay description: Inhibition of Acetylcholinesterase activity of calf forebrain
In DepthDetails ArticlePubMed
TargetAcetylcholinesterase(Homo sapiens (Human))
University Of North Texas
Curated by ChEMBL
LigandPNGBDBM50059894(CHEMBL103153 | [2-(2-Ethyl-phenylsulfanylcarbonylo...)
Affinity DataIC50:  5.00E+4nM. Assay description: Inhibition of Acetylcholinesterase from human red blood cells
In DepthDetails ArticlePubMed