BDBM50060045 4-[(S)-3-(3-Carbamimidoyl-phenyl)-2-(naphthalene-2-sulfonylamino)-propionyl]-piperazine-1-carboxylic acid dimethylamide::CHEMBL318352
SMILES CN(C)C(=O)N1CCN(CC1)C(=O)[C@H](Cc1cccc(c1)C(N)=N)NS(=O)(=O)c1ccc2ccccc2c1
InChI Key InChIKey=AMRRXWBRMUATPJ-DEOSSOPVSA-N
Data  5 KI
  Tab Delimited (TSV)   2D SDfile   Computed 3D by Vconf -m prep SDfile
Find this compound or compounds like it in BindingDB:
Activity Spreadsheet -- Enzyme Inhibition Constant Data from BindingDB
Found 5 hits for monomerid = 50060045
TargetProthrombin(Bos taurus (Bovine))
University Of Marburg
Curated by ChEMBL
LigandPNGBDBM50060045(4-[(S)-3-(3-Carbamimidoyl-phenyl)-2-(naphthalene-2...)
Affinity DataKi:  8.70nM. Assay description: Binding affinity towards thrombin
In DepthDetails ArticlePubMed
TargetSerine protease 1(Bos taurus (bovine))
University Of Marburg
Curated by ChEMBL
LigandPNGBDBM50060045(4-[(S)-3-(3-Carbamimidoyl-phenyl)-2-(naphthalene-2...)
Affinity DataKi:  169nM. Assay description: Binding affinity towards trypsin
In DepthDetails ArticlePubMed
TargetProthrombin(Bos taurus (Bovine))
University Of Marburg
Curated by ChEMBL
LigandPNGBDBM50060045(4-[(S)-3-(3-Carbamimidoyl-phenyl)-2-(naphthalene-2...)
Affinity DataKi:  350nM. Assay description: Inhibitory activity against thrombin
In DepthDetails ArticlePubMed
TargetAnionic trypsin(Bos taurus)
Klinikum Der Friedrich-Schiller-Universit£T Jena
Curated by ChEMBL
LigandPNGBDBM50060045(4-[(S)-3-(3-Carbamimidoyl-phenyl)-2-(naphthalene-2...)
Affinity DataKi:  8.50E+3nM. Assay description: Inhibitory activity against trypsin
In DepthDetails ArticlePubMed
TargetCoagulation factor X(Homo sapiens (Human))
University Of Marburg
Curated by ChEMBL
LigandPNGBDBM50060045(4-[(S)-3-(3-Carbamimidoyl-phenyl)-2-(naphthalene-2...)
Affinity DataKi:  2.39E+4nM. Assay description: Binding affinity towards Coagulation factor Xa
In DepthDetails ArticlePubMed