BDBM50061175 (10R,13S,17R)-17-[1-(2H-Imidazol-2-yl)-ethyl]-10,13-dimethyl-1,2,6,7,8,9,10,11,12,13,14,15,16,17-tetradecahydro-cyclopenta[a]phenanthren-3-one::CHEMBL112039
SMILES CC(C1N=CC=N1)[C@H]1CCC2C3CCC4=CC(=O)CC[C@]4(C)C3CC[C@]12C
InChI Key InChIKey=RMALHIYLKVZMFX-RXPYYBBQSA-N
Data  1 IC50
  Tab Delimited (TSV)   2D SDfile   Computed 3D by Vconf -m prep SDfile
Find this compound or compounds like it in BindingDB:
Activity Spreadsheet -- Enzyme Inhibition Constant Data from BindingDB
Found 1 hit for monomerid = 50061175
TargetSteroid 17-alpha-hydroxylase/17,20 lyase(Homo sapiens (Human))
University Of Maryland
Curated by ChEMBL
LigandPNGBDBM50061175((10R,13S,17R)-17-[1-(2H-Imidazol-2-yl)-ethyl]-10,1...)
Affinity DataIC50: >3.00E+4nM. Assay description: Inhibition of human testicular microsomal Cytochrome P450 17A1
In DepthDetails ArticlePubMed